Uploaded image for project: 'Couchbase Server'
  1. Couchbase Server
  2. MB-7973

2.1 macosx build fails during couchdbx-app phase due to missing cbanalyze-core

    Details

    • Type: Bug
    • Status: Resolved
    • Priority: Major
    • Resolution: Fixed
    • Affects Version/s: 3.0
    • Fix Version/s: 3.0
    • Component/s: build
    • Security Level: Public
    • Labels:
      None

      Description

      PhaseScriptExecution "Install Core" "build/Couchbase Server.build/Release/Couchbase Server.build/Script-DA638E1B13E1F7BA005E6A5B.sh"
      cd /Users/buildbot/mac-x64-21-builder/build/build/couchdbx-app
      /bin/sh -c "\"/Users/buildbot/mac-x64-21-builder/build/build/couchdbx-app/build/Couchbase Server.build/Release/Couchbase Server.build/Script-DA638E1B13E1F7BA005E6A5B.sh\""
      Installing and fixing up libraries:
      Fixing library imports in bin ...
      /Users/buildbot/mac-x64-21-builder/build/build/couchdbx-app/Couchbase Server/install_libraries.rb:38: warning: Insecure world writable dir /opt/couchbase in PATH, mode 040777

      Fixing library imports in lib ...

      Done fixing library imports!
      fixing path for cb* commands in /Users/buildbot/mac-x64-21-builder/build/build/couchdbx-app/build/Release/Couchbase Server.app/Contents/Resources/couchbase-core
      Fixing Python lib path in bin/cbbackup
      Fixing Python lib path in bin/cbepctl
      Fixing Python lib path in bin/cbrestore
      Fixing Python lib path in bin/cbstats
      Fixing Python lib path in bin/cbtransfer
      Fixing Python lib path in bin/cbvbucketctl
      Fixing Python lib path in bin/couchbase-cli
      Fixing Python lib path in bin/tools/cbanalyze-core
      sed: bin/tools/cbanalyze-core: No such file or directory

        • BUILD FAILED **

      The following build commands failed:
      PhaseScriptExecution "Install Core" "build/Couchbase Server.build/Release/Couchbase Server.build/Script-DA638E1B13E1F7BA005E6A5B.sh"
      (1 failure)
      make[1]: *** [couchbase-server-zip] Error 65
      make: *** [package-mac] Error 2
      program finished with exit code 2

      No reviews matched the request. Check your Options in the drop-down menu of this sections header.

        Activity

        Hide
        plabee Phil Labee (Inactive) added a comment -

        commit: 590f96de205abc336160367926e77fc68c613c42

        in coucdbx-app changes the install-couchbase.sh script to look for cbanalyze-core in bin, not bin/tools

        Show
        plabee Phil Labee (Inactive) added a comment - commit: 590f96de205abc336160367926e77fc68c613c42 in coucdbx-app changes the install-couchbase.sh script to look for cbanalyze-core in bin, not bin/tools
        Hide
        plabee Phil Labee (Inactive) added a comment -

        fixed starting in build 2.1.0-739 (2013-4-23)

        http://qa.hq.northscale.net:8010/builders/mac-x64-21-builder/builds/37

        Show
        plabee Phil Labee (Inactive) added a comment - fixed starting in build 2.1.0-739 (2013-4-23) http://qa.hq.northscale.net:8010/builders/mac-x64-21-builder/builds/37

          People

          • Assignee:
            plabee Phil Labee (Inactive)
            Reporter:
            plabee Phil Labee (Inactive)
          • Votes:
            0 Vote for this issue
            Watchers:
            1 Start watching this issue

            Dates

            • Created:
              Updated:
              Resolved:

              Gerrit Reviews

              There are no open Gerrit changes