Uploaded image for project: 'Couchbase Server'
  1. Couchbase Server
  2. MB-8129

2.0.2 macosx build fails during couchdbx-app phase due to missing cbworkloadgen

    Details

    • Type: Bug
    • Status: Closed
    • Priority: Critical
    • Resolution: Fixed
    • Affects Version/s: 2.1.0
    • Fix Version/s: 2.1.0
    • Component/s: build
    • Security Level: Public
    • Labels:
      None

      Description

      xcodebuild -target 'Couchbase Server Zip' -configuration Release
      . . .
      PhaseScriptExecution "Install Core" "build/Couchbase Server.build/Release/Couchbase Server.build/Script-DA638E1B13E1F7BA005E6A5B.sh"
      cd /Users/buildbot/mac-x64-202-builder/build/build/couchdbx-app
      /bin/sh -c "\"/Users/buildbot/mac-x64-202-builder/build/build/couchdbx-app/build/Couchbase Server.build/Release/Couchbase Server.build/Script-DA638E1B13E1F7BA005E6A5B.sh\""
      Installing and fixing up libraries:
      Fixing library imports in bin ...
      /Users/buildbot/mac-x64-202-builder/build/build/couchdbx-app/Couchbase Server/install_libraries.rb:38: warning: Insecure world writable dir /opt/couchbase in PATH, mode 040777

      Fixing library imports in lib ...

      Done fixing library imports!
      fixing path for cb* commands in /Users/buildbot/mac-x64-202-builder/build/build/couchdbx-app/build/Release/Couchbase Server.app/Contents/Resources/couchbase-core
      Fixing Python lib path in bin/cbbackup
      Fixing Python lib path in bin/cbepctl
      Fixing Python lib path in bin/cbrestore
      Fixing Python lib path in bin/cbstats
      Fixing Python lib path in bin/cbtransfer
      Fixing Python lib path in bin/cbvbucketctl
      Fixing Python lib path in bin/couchbase-cli
      Fixing Python lib path in bin/tools/cbanalyze-core
      Fixing Python lib path in bin/tools/cbdocloader
      Fixing Python lib path in bin/tools/cbworkloadgen
      sed: bin/tools/cbworkloadgen: No such file or directory

        • BUILD FAILED **

      The following build commands failed:
      PhaseScriptExecution "Install Core" "build/Couchbase Server.build/Release/Couchbase Server.build/Script-DA638E1B13E1F7BA005E6A5B.sh"
      (1 failure)
      make[1]: *** [couchbase-server-zip] Error 65
      make: *** [package-mac] Error 2
      program finished with exit code 2

      # Subject Project Status CR V
      For Gerrit Dashboard: &For+MB-8129=message:MB-8129

        Activity

        Hide
        wayne Wayne Siu added a comment -

        Phil, can you take a look at this 2.0.2 related ticket?

        Show
        wayne Wayne Siu added a comment - Phil, can you take a look at this 2.0.2 related ticket?
        Hide
        plabee Phil Labee (Inactive) added a comment -

        commit: cf709acdb8ee24cef158a2007189184e1e0f8016

        in couchdbx-app changes the install-couchbase.sh script to look for cbworkloadgen in bin, not bin/tools

        Show
        plabee Phil Labee (Inactive) added a comment - commit: cf709acdb8ee24cef158a2007189184e1e0f8016 in couchdbx-app changes the install-couchbase.sh script to look for cbworkloadgen in bin, not bin/tools
        Hide
        plabee Phil Labee (Inactive) added a comment - - edited
        Show
        plabee Phil Labee (Inactive) added a comment - - edited fixed in build 2.0.2-772 (2013-4-23) http://qa.hq.northscale.net:8010/builders/mac-x64-202-builder/builds/79
        Hide
        maria Maria McDuff (Inactive) added a comment -

        pls verify / close.

        Show
        maria Maria McDuff (Inactive) added a comment - pls verify / close.

          People

          • Assignee:
            Chisheng Chisheng Hong (Inactive)
            Reporter:
            plabee Phil Labee (Inactive)
          • Votes:
            0 Vote for this issue
            Watchers:
            4 Start watching this issue

            Dates

            • Created:
              Updated:
              Resolved:

              Gerrit Reviews

              There are no open Gerrit changes